Heptyl 4-chlorobutanoate

Kovats' RI, non-polar column, isothermal

View large format table.

Column type Active phase Temperature (C) I Reference Comment
CapillarySE-30120.1518.Haken and Korhonen, 1985N2; Column length: 25. m; Column diameter: 0.33 mm
CapillarySE-30140.1500.Haken and Korhonen, 1985N2; Column length: 25. m; Column diameter: 0.33 mm
CapillarySE-30160.1501.Haken and Korhonen, 1985N2; Column length: 25. m; Column diameter: 0.33 mm
CapillarySE-30180.1503.Haken and Korhonen, 1985N2; Column length: 25. m; Column diameter: 0.33 mm
CapillarySE-30200.1510.Haken and Korhonen, 1985N2; Column length: 25. m; Column diameter: 0.33 mm

References

Haken and Korhonen, 1985
Haken, J.K.; Korhonen, I.O.O., Gas chromatography of homologous esters. XXVIII. Retention increments of aliphatic C1-C18 n-alkyl esters of butanoic acid and its monochloro derivatives on SE-30 and OV-351 capillary columns, J. Chromatogr., 1985, 320, 2, 325-334, https://doi.org/10.1016/S0021-9673(01)90510-2 . [all data]