9-Hentriacontene

Kovats' RI, non-polar column, isothermal

View large format table.

Column type Active phase Temperature (C) I Reference Comment
CapillaryDB-1230.3071.23Stránský, Valterová, et al., 200130. m/0.25 mm/0.25 μm, H2

Van Den Dool and Kratz RI, non-polar column, custom temperature program

View large format table.

Column type Active phase I Reference Comment
CapillaryMethyl Silicone3069.Kaib, Jmhasly, et al., 2004Program: 80C(1.5min) =.40C/min => 160C => 2.5C/min => 280C

Normal alkane RI, non-polar column, temperature ramp

View large format table.

Column type Active phase I Reference Comment
CapillaryDexsil 3003070.Lockey, 19785. K/min; Column length: 15. m; Tstart: 50. C; Tend: 370. C
CapillaryDexsil 3003082.Lockey, 19785. K/min; Column length: 15. m; Tstart: 50. C; Tend: 370. C

References

Stránský, Valterová, et al., 2001
Stránský, K.; Valterová, I.; Fiedler, P., Nonsaponifiable lipid components of the pollen of elder (Sambucus nigra L.), J. Chromatogr. A, 2001, 936, 1-2, 173-181, https://doi.org/10.1016/S0021-9673(01)01313-9 . [all data]

Kaib, Jmhasly, et al., 2004
Kaib, M.; Jmhasly, P.; Wilfert, L.; Durka, W.; Franke, S.; Francke, W.; Leuthold, R.H.; Brandl, R., Cuticular hydrocarbons and aggression in the termite Macrotermes Subhyalinus, J. Chem. Ecol., 2004, 30, 2, 365-385, https://doi.org/10.1023/B:JOEC.0000017983.89279.c5 . [all data]

Lockey, 1978
Lockey, K.H., The adult cuticular hydrocarbons of Tenebrio Molitor L. and Tenebrio Obscurus F. (Coleoptera: Tenebrionidae), Insect Biochem., 1978, 8, 4, 237-250, https://doi.org/10.1016/0020-1790(78)90032-X . [all data]