7-heptacosene

Van Den Dool and Kratz RI, non-polar column, temperature ramp

Data compiled by: NIST Mass Spectrometry Data Center, William E. Wallace, director

Column type Capillary
Active phase DB-5MS
Column length (m) 30.
Carrier gas He
Substrate
Column diameter (mm) 0.32
Phase thickness (μm) 0.25
Tstart (C) 150.
Tend (C) 280.
Heat rate (K/min) 3.
Initial hold (min)
Final hold (min)
I 2681.
ReferenceSteinmetz, Schmolz, et al., 2003
Comment MSDC-RI

Kovats' RI, non-polar column, isothermal

Data compiled by: NIST Mass Spectrometry Data Center, William E. Wallace, director

Column type Capillary
Active phase DB-1
Column length (m) 30.
Carrier gas H2
Substrate
Column diameter (mm) 0.25
Phase thickness (μm) 0.25
Temperature (C) 230.
I 2678.86
ReferenceStránský, Valterová, et al., 2001
Comment MSDC-RI

Van Den Dool and Kratz RI, non-polar column, custom temperature program

View large format table.

Column type Active phase I Reference Comment
CapillaryMethyl Silicone2676.Kaib, Jmhasly, et al., 2004Program: 80C(1.5min) =.40C/min => 160C => 2.5C/min => 280C

References

Steinmetz, Schmolz, et al., 2003
Steinmetz, I.; Schmolz, E.; Ruther, J., Cuticular lipids as trail pheromone in a social wasp, Proc. R. Soc. London B:, 2003, 270, 1513, 385-391, https://doi.org/10.1098/rspb.2002.2256 . [all data]