trans-Muurola-4(14),5-diene

Kovats' RI, non-polar column, custom temperature program

Data compiled by: NIST Mass Spectrometry Data Center, William E. Wallace, director

Column type Capillary
Active phase CP Sil 8 CB
Column length (m) 50.
Carrier gas He
Substrate
Column diameter (mm) 0.32
Phase thickness (μm) 0.25
Program 60C(1min) => 3C/min => 70C => 15C/min => 170C(8min) => 5C/min => 250C
I 1494.
ReferenceRadusiene, Judzentiene, et al., 2005
Comment MSDC-RI

Normal alkane RI, non-polar column, custom temperature program

Data compiled by: NIST Mass Spectrometry Data Center, William E. Wallace, director

Column type CapillaryCapillaryCapillaryCapillaryCapillary
Active phase CP Sil 8 CBSLB-5 MSCP Sil 8 CBCP Sil 8 CBCP Sil 8 CB
Column length (m) 50.30.50.50.50.
Carrier gas HeliumHeliumHeHeHe
Substrate
Column diameter (mm) 0.320.250.320.320.32
Phase thickness (μm) 0.250.250.250.250.25
Program not specifiednot specified60 0C (2 min) 5 0C/min -> 160 0C 10 0C/min -> 250 0C (5 min)50C(5min) => 2C/min => 90C => 15C/min => 240C(4min)60C(2min) => 5C/min => 160C(1min) => 10C/min => 250C (3min)
I 1495.1490.1494.1494.1494.
ReferenceKupcinskiene, Stikliene, et al., 2008Lo Presti, Sciarrone, et al., 2008Mockute, Bernotiene, et al., 2006Butkienë, Nivinskienë, et al., 2005Radudienë, Judpintienë, et al., 2005
Comment MSDC-RI MSDC-RI MSDC-RI MSDC-RI MSDC-RI
Column type Capillary
Active phase CP Sil 8 CB
Column length (m) 50.
Carrier gas He
Substrate
Column diameter (mm) 0.32
Phase thickness (μm) 0.25
Program 50C(5min) => 2C/min => 90C => 15C/min => 240C(4min)
I 1494.
ReferenceButkienë, Nivinskienë, et al., 2004
Comment MSDC-RI

References

Radusiene, Judzentiene, et al., 2005
Radusiene, J.; Judzentiene, A.; Bernotiene, G., Essential oil composition and variability of Hypericum perforatum L. growing in Lithuania, Biochem. Syst. Ecol., 2005, 33, 2, 113-124, https://doi.org/10.1016/j.bse.2004.06.010 . [all data]