7,10-Anhydro-11,12-dihydrochiloscypholone

Van Den Dool and Kratz RI, non-polar column, custom temperature program

Data compiled by: NIST Mass Spectrometry Data Center, William E. Wallace, director

Column type Capillary
Active phase CP Sil 5 CB
Column length (m) 25.
Carrier gas
Substrate
Column diameter (mm)
Phase thickness (μm)
Program not specified
I 1452.
ReferencePaul, König, et al., 2001
Comment MSDC-RI

References

Paul, König, et al., 2001
Paul, C.; König, W.A.; Wu, C.-L., Sesquiterpenoid constituents of the liverworts Lepidozia fauriana and Lepidozia vitrea, Phytochemistry, 2001, 58, 5, 789-798, https://doi.org/10.1016/S0031-9422(01)00322-3 . [all data]