GA119 (1α-hydroxy GA9), MeTMS

Normal alkane RI, non-polar column, custom temperature program

Data compiled by: NIST Mass Spectrometry Data Center, William E. Wallace, director

Column type CapillaryCapillary
Active phase DB-1DB-1
Column length (m) 30.30.
Carrier gas HeHe
Substrate
Column diameter (mm) 0.250.25
Phase thickness (μm) 0.250.25
Program 60C (2min) => 2C/min => 210C => 2C/min => 280C(5min)60C (2min) => 2C/min => 210C => 2C/min => 280C(5min)
I 2538.2537.
ReferenceNakayama, Koshioka, et al., 2001Nakayama, Koshioka, et al., 2001
Comment MSDC-RI MSDC-RI

References

Nakayama, Koshioka, et al., 2001
Nakayama, M.; Koshioka, M.; Matsui, H.; Ohara, H.; Mander, L.N.; Leitch, S.K.; Twitchin, B.; Kraft-Klaunzer, P.; Pharis, R.P.; Yokota, T., Endogenous gibberellins in immature seeds of Prunus persica L.: identification of GA118, GA119, GA120, GA121, GA122 and GA126, Phytochemistry, 2001, 57, 5, 749-758, https://doi.org/10.1016/S0031-9422(01)00154-6 . [all data]