2,5-epoxy-megastigma-6(Z),8(E)-diene

Van Den Dool and Kratz RI, non-polar column, custom temperature program

View large format table.

Column type Active phase I Reference Comment
CapillaryDB-5MS1312.Boulanger and Crouzet, 200130. m/0.25 mm/0.25 μm, H2; Program: 40C (5min) => 2C/min => 200C => 5C/min => 250C (15min)

References

Boulanger and Crouzet, 2001
Boulanger, R.; Crouzet, J., Identification of the aroma components of acerola (Malphigia glabra L.): free and bound flavor compounds, Food Chem., 2001, 74, 2, 209-216, https://doi.org/10.1016/S0308-8146(01)00128-5 . [all data]