N,N-Dimethyl-2-(2-nitro-phenyl)-2-(3-nitro-phenyl)-acetamide

Kovats' RI, non-polar column, isothermal

View large format table.

Column type Active phase Temperature (C) I Reference Comment
CapillaryOV-1230.2597.Soják, Perjéssy, et al., 20006. m/0.32 mm/0.4 μm, He

Van Den Dool and Kratz RI, non-polar column, temperature ramp

View large format table.

Column type Active phase I Reference Comment
CapillaryOV-12608.Soják, Perjéssy, et al., 20006. m/0.32 mm/0.4 μm, He, 30. K/min; Tstart: 150. C; Tend: 310. C

References

Soják, Perjéssy, et al., 2000
Soják, L.; Perjéssy, A.; Kubinec, R.; Cambáliková, J.; Giumanini, A.G.; Verardo, G.; Magnan, M.M., Gas chromatography-mass spectrometry-Fourier transform infrared spectrometry and high-performance liquid chromatographic characterization of mononitro- and dinitro-isomers from the nitration of N,N-dimethyldiphenylacetamide, J. Chromatogr. A, 2000, 878, 2, 235-247, https://doi.org/10.1016/S0021-9673(00)00287-9 . [all data]