Fenproporex-M (desamino-oxo-di-HO), 2AC

Kovats' RI, non-polar column, temperature ramp

View large format table.

Column type Active phase I Reference Comment
CapillaryCross-Linked Methylsilicone1735.Kraemer, Theis, et al., 200012. m/0.2 mm/0.33 μm, He, 100. C @ 3. min, 30. K/min, 310. C @ 8. min

References

Kraemer, Theis, et al., 2000
Kraemer, T.; Theis, G.A.; Weber, A.A.; Maurer, H.H., Studies on the metabolism and toxicological detection of the amphetamine-like anorectic fenproporex in human urine by gas chromatography-mass spectrometry and fluorescence polarization immunoassay, J. Chromatogr. B, 2000, 738, 1, 107-118, https://doi.org/10.1016/S0378-4347(99)00497-1 . [all data]