α-Cyperone

Van Den Dool and Kratz RI, polar column, temperature ramp

Data compiled by: NIST Mass Spectrometry Data Center, William E. Wallace, director

Column type CapillaryCapillary
Active phase Supelcowax-10RTX-Wax
Column length (m) 30.60.
Carrier gas HeHe
Substrate
Column diameter (mm) 0.20.22
Phase thickness (μm) 0.20.25
Tstart (C) 70.60.
Tend (C) 220.230.
Heat rate (K/min) 3.2.
Initial hold (min)
Final hold (min) 15.45.
I 2328.2335.
ReferenceCavaleiro, Salgueiro, et al., 2004Cavalli, Tomi, et al., 2003
Comment MSDC-RI MSDC-RI

Kovats' RI, non-polar column, temperature ramp

Data compiled by: NIST Mass Spectrometry Data Center, William E. Wallace, director

Column type Capillary
Active phase HP-5MS
Column length (m) 30.
Carrier gas He
Substrate
Column diameter (mm) 0.32
Phase thickness (μm) 0.25
Tstart (C) 70.
Tend (C) 250.
Heat rate (K/min) 3.
Initial hold (min) 5.
Final hold (min)
I 1746.
ReferenceSiani, Ramos, et al., 1999
Comment MSDC-RI

Normal alkane RI, non-polar column, custom temperature program

Data compiled by: NIST Mass Spectrometry Data Center, William E. Wallace, director

Column type CapillaryCapillary
Active phase SPB-5SPB-5
Column length (m)
Carrier gas
Substrate
Column diameter (mm)
Phase thickness (μm)
Program not specifiednot specified
I 1710.1719.
ReferenceKilani, Ledauphin, et al., 2008Kilani, Ledauphin, et al., 2008
Comment MSDC-RI MSDC-RI

References

Cavaleiro, Salgueiro, et al., 2004
Cavaleiro, C.; Salgueiro, L.R.; Miguel, M.G.; da Cunha, A.P., Analysis by gas chromatography?mass spectrometry of the volatile components of Teucrium lusitanicum and Teucrium algarbiensis, J. Chromatogr. A, 2004, 1033, 1, 187-190, https://doi.org/10.1016/j.chroma.2004.01.005 . [all data]

Cavalli, Tomi, et al., 2003
Cavalli, J.-F.; Tomi, F.; Bernardini, A.-F.; Casanova, J., Composition and chemical variability of the bark oil of Cedrelopsis grevei H. Baillon from Madagascar, Flavour Fragr. J., 2003, 18, 6, 532-538, https://doi.org/10.1002/ffj.1263 . [all data]