3,4-dimethylheptadecane

Normal alkane RI, non-polar column, temperature ramp

View large format table.

Column type Active phase I Reference Comment
CapillaryDB-51851.Köster, Volkman, et al., 199930. m/0.25 mm/0.25 μm, 60. C @ 2. min, 3. K/min, 305. C @ 50. min

References

Köster, Volkman, et al., 1999
Köster, J.; Volkman, J.K.; Rullkötter, J.; Scholz-Böttcher, B.M.; Rethmeier, J.; Fishcer, U., Mono-, di- and trimethyl-branched alkanes in cultures of the filamentous cyanobacterium Calothrix scopulorum, Org. Geochem., 1999, 30, 11, 1367-1379, https://doi.org/10.1016/S0146-6380(99)00110-2 . [all data]