9-Methylhentriacontane

Normal alkane RI, non-polar column, temperature ramp

Data compiled by: NIST Mass Spectrometry Data Center, William E. Wallace, director

Column type CapillaryCapillaryCapillaryCapillary
Active phase Ultra-1BP-1Dexsil 300Dexsil 300
Column length (m) 12.512.15.15.
Carrier gas HeHelium
Substrate
Column diameter (mm) 0.20.22
Phase thickness (μm)  0.25
Tstart (C) 150.100.50.50.
Tend (C) 320.300.370.370.
Heat rate (K/min) 4.2.5.5.
Initial hold (min)
Final hold (min)
I 3130.3126.3130.3130.
ReferenceNelson and Charlet, 2003Lockey and Oraha, 1990Lockey, 1978Lockey, 1978
Comment MSDC-RI MSDC-RI MSDC-RI MSDC-RI

References

Nelson and Charlet, 2003
Nelson, D.R.; Charlet, L.D., Cuticular hydrocarbons of the sunflower beetle,Zygogramma exclamationis, Comp. Biochem. Physiol. B: Comp. Biochem., 2003, 135, 2, 273-284, https://doi.org/10.1016/S1096-4959(03)00080-0 . [all data]

Lockey and Oraha, 1990
Lockey, K.H.; Oraha, V.S., Cuticular lipids of adult Locusta Migratoria Migratoriodes (R and F), Schstocerca Gregaria (Forskal) (Acrididae) and other orthopteran species - II. Hydrocarbons, Comp. Biochem. Physiol., 1990, 95B, 4, 721-744. [all data]

Lockey, 1978
Lockey, K.H., The adult cuticular hydrocarbons of Tenebrio Molitor L. and Tenebrio Obscurus F. (Coleoptera: Tenebrionidae), Insect Biochem., 1978, 8, 4, 237-250, https://doi.org/10.1016/0020-1790(78)90032-X . [all data]