3,15-dimethylheptatriacontane
- Formula: C39H80
- Molecular weight: 549.0525
- IUPAC Standard InChIKey: ZWMSMPPHLSPJDK-UHFFFAOYSA-N
- Chemical structure:

Van Den Dool and Kratz RI, non-polar column, custom temperature program

Column type | Active phase | I | Reference | Comment |
---|---|---|---|---|
Capillary | DB-1 | 3803. | Bernier, Carlson, et al., 1998 | 30. m/0.32 mm/0.25 μm; Program: 60C (2min) => 10C/min => 220C => 3C/min => 310C |

Normal alkane RI, non-polar column, temperature ramp

Column type | Active phase | I | Reference | Comment |
---|---|---|---|---|
Capillary | DB-1 | 3801. | Katritzky, Chen, et al., 2000 | 30. m/0.32 mm/0.25 μm; Tstart: 60. C; Tend: 320. C |

Normal alkane RI, non-polar column, custom temperature program

Column type | Active phase | I | Reference | Comment |
---|---|---|---|---|
Capillary | Polydimethyl siloxane | 3801. | Junkes, Castanho, et al., 2003 | Program: not specified |
Capillary | DB-1 | 3803. | Carlson, Geden, et al., 1999 | 30. m/0.32 mm/0.25 μm, He; Program: 60C (2min) => 10C/min => 220C => 3C/min => 310C (12 - 42 min) |

References

Bernier, Carlson, et al., 1998
Bernier, U.R.; Carlson, D.A.; Geden, C.J.,
Gas chromatography/mass spectrometry analysis of the cuticular hydrocarbons from parasitic wasps of the genus Muscidifurax,
J. Am. Soc. Mass Spectrom., 1998, 9, 4, 320-332, https://doi.org/10.1016/S1044-0305(97)00288-2
. [all data]
Katritzky, Chen, et al., 2000
Katritzky, A.R.; Chen, K.; Maran, U.; Carlson, D.A.,
QSPR Correlation and predictions of GC retention indexes for methyl-branched hydrocarbons produced by insects,
Anal. Chem., 2000, 72, 1, 101-109, https://doi.org/10.1021/ac990800w
. [all data]
Junkes, Castanho, et al., 2003
Junkes, B.S.; Castanho, R.D.M.; Amboni, C.; Yunes, R.A.; Heinzen, V.E.F.,
Semiempirical Topological Index: A Novel Molecular Descriptor for Quantitative Structure-Retention Relationship Studies,
Internet Electronic Journal of Molecular Design, 2003, 2, 1, 33-49. [all data]
Carlson, Geden, et al., 1999
Carlson, D.A.; Geden, C.J.; Bernier, U.R.,
Identification of pupal exiviae of Nasania vitripennis and Muscidifurax raptorellus parasitoids using cuticular hydrocarbons,
Biol. Control, 1999, 15, 2, 97-106, https://doi.org/10.1006/bcon.1999.0708
. [all data]