13,17-Dimethyltetratriacontane

Van Den Dool and Kratz RI, non-polar column, custom temperature program

View large format table.

Column type Active phase I Reference Comment
CapillaryDB-13455.Bernier, Carlson, et al., 199830. m/0.32 mm/0.25 μm; Program: 60C (2min) => 10C/min => 220C => 3C/min => 310C

Normal alkane RI, non-polar column, temperature ramp

View large format table.

Column type Active phase I Reference Comment
PackedOV-1013449.Nelson, de Renobales, et al., 1989Helium, Gas-Chrom Q (100-120 mesh), 3. K/min, 320. C @ 25. min; Column length: 3. m; Tstart: 150. C
PackedOV-1013460.Nelson, de Renobales, et al., 1989Helium, Gas-Chrom Q (100-120 mesh), 3. K/min, 320. C @ 25. min; Column length: 3. m; Tstart: 150. C

Normal alkane RI, non-polar column, custom temperature program

View large format table.

Column type Active phase I Reference Comment
CapillaryPolydimethyl siloxane3455.Junkes, Castanho, et al., 2003Program: not specified
CapillaryDB-13455.Carlson, Geden, et al., 199930. m/0.32 mm/0.25 μm, He; Program: 60C (2min) => 10C/min => 220C => 3C/min => 310C (12 - 42 min)
CapillaryDexsil 3003454.Lockey, 1981Column length: 15. m; Program: 50 0C 5 0C/min -> 200 0C 2 0C/min -> 340 0C

References

Bernier, Carlson, et al., 1998
Bernier, U.R.; Carlson, D.A.; Geden, C.J., Gas chromatography/mass spectrometry analysis of the cuticular hydrocarbons from parasitic wasps of the genus Muscidifurax, J. Am. Soc. Mass Spectrom., 1998, 9, 4, 320-332, https://doi.org/10.1016/S1044-0305(97)00288-2 . [all data]

Nelson, de Renobales, et al., 1989
Nelson, D.R.; de Renobales, M.; Dwyer, L.A.; Zamboni, A.C.; Fatland, C.L.; Blomquist, G.J., Novel very long-chain methyl branched alcohols and their esters, and methyl branched alkanes in pupae of the gabbage looper, Trichoplusa ni (Hubner), Insect Biochem., 1989, 19, 2, 197-208, https://doi.org/10.1016/0020-1790(89)90092-9 . [all data]

Junkes, Castanho, et al., 2003
Junkes, B.S.; Castanho, R.D.M.; Amboni, C.; Yunes, R.A.; Heinzen, V.E.F., Semiempirical Topological Index: A Novel Molecular Descriptor for Quantitative Structure-Retention Relationship Studies, Internet Electronic Journal of Molecular Design, 2003, 2, 1, 33-49. [all data]

Carlson, Geden, et al., 1999
Carlson, D.A.; Geden, C.J.; Bernier, U.R., Identification of pupal exiviae of Nasania vitripennis and Muscidifurax raptorellus parasitoids using cuticular hydrocarbons, Biol. Control, 1999, 15, 2, 97-106, https://doi.org/10.1006/bcon.1999.0708 . [all data]

Lockey, 1981
Lockey, K.H., Cuticular hydrocarbons of adult Cylindrinotus laevioctostriatus (Goeze) and Phylan gibbus (Fabricius) (Coleoptera: Tenebrionidae), Insect. Biochem., 1981, 11, 5, 549-561, https://doi.org/10.1016/0020-1790(81)90023-8 . [all data]