11-Methylpentatriacontane

Normal alkane RI, non-polar column, temperature ramp

Data compiled by: NIST Mass Spectrometry Data Center, William E. Wallace, director

Column type CapillaryCapillaryPackedPacked
Active phase Ultra-1BP-1OV-101Dexsil 300
Column length (m) 12.512.3.2.
Carrier gas HeHeliumHeliumNitrogen
Substrate   Gas-Chrom Q (100-120 mesh)Chromosorb W (80-100 mesh)
Column diameter (mm) 0.20.22
Phase thickness (μm)  0.25
Tstart (C) 150.100.150.80.
Tend (C) 320.300.320.340.
Heat rate (K/min) 4.2.3.3.3
Initial hold (min)
Final hold (min)   25.
I 3526.3527.3530.3533.
ReferenceNelson and Charlet, 2003Lockey and Oraha, 1990Nelson, de Renobales, et al., 1989Lockey, 1976
Comment MSDC-RI MSDC-RI MSDC-RI MSDC-RI

References

Nelson and Charlet, 2003
Nelson, D.R.; Charlet, L.D., Cuticular hydrocarbons of the sunflower beetle,Zygogramma exclamationis, Comp. Biochem. Physiol. B: Comp. Biochem., 2003, 135, 2, 273-284, https://doi.org/10.1016/S1096-4959(03)00080-0 . [all data]

Lockey and Oraha, 1990
Lockey, K.H.; Oraha, V.S., Cuticular lipids of adult Locusta Migratoria Migratoriodes (R and F), Schstocerca Gregaria (Forskal) (Acrididae) and other orthopteran species - II. Hydrocarbons, Comp. Biochem. Physiol., 1990, 95B, 4, 721-744. [all data]

Nelson, de Renobales, et al., 1989
Nelson, D.R.; de Renobales, M.; Dwyer, L.A.; Zamboni, A.C.; Fatland, C.L.; Blomquist, G.J., Novel very long-chain methyl branched alcohols and their esters, and methyl branched alkanes in pupae of the gabbage looper, Trichoplusa ni (Hubner), Insect Biochem., 1989, 19, 2, 197-208, https://doi.org/10.1016/0020-1790(89)90092-9 . [all data]

Lockey, 1976
Lockey, K.H., Cuticular hydrocarbons of Locusta, Schistocerca, and Periplaneta, and their role in waterproofing, Insect Biochem., 1976, 6, 5, 457-472, https://doi.org/10.1016/0020-1790(76)90068-8 . [all data]