10-methyl-triacontane

Van Den Dool and Kratz RI, non-polar column, custom temperature program

Data compiled by: NIST Mass Spectrometry Data Center, William E. Wallace, director

Column type CapillaryCapillary
Active phase DB-1DB-1
Column length (m) 30.30.
Carrier gas  He
Substrate
Column diameter (mm) 0.320.25
Phase thickness (μm) 0.25
Program 60C (2min) => 10C/min => 220C => 3C/min => 310C60C => 20C/min => 230C => 5C/min => 330C
I 3035.3034.
ReferenceBernier, Carlson, et al., 1998Sutton and Carlson, 1993
Comment MSDC-RI MSDC-RI

Normal alkane RI, non-polar column, custom temperature program

Data compiled by: NIST Mass Spectrometry Data Center, William E. Wallace, director

Column type Capillary
Active phase DB-1
Column length (m) 30.
Carrier gas He
Substrate
Column diameter (mm) 0.32
Phase thickness (μm) 0.25
Program 60C (2min) => 10C/min => 220C => 3C/min => 310C (12 - 42 min)
I 3035.
ReferenceCarlson, Geden, et al., 1999
Comment MSDC-RI

References

Bernier, Carlson, et al., 1998
Bernier, U.R.; Carlson, D.A.; Geden, C.J., Gas chromatography/mass spectrometry analysis of the cuticular hydrocarbons from parasitic wasps of the genus Muscidifurax, J. Am. Soc. Mass Spectrom., 1998, 9, 4, 320-332, https://doi.org/10.1016/S1044-0305(97)00288-2 . [all data]

Sutton and Carlson, 1993
Sutton, B.D.; Carlson, D.A., Interspecific variation in tephritid fruit fly larvae surface hydrocarbons, Arch. Insect Biochem. Physiol., 1993, 23, 2, 53-65, https://doi.org/10.1002/arch.940230202 . [all data]