GA116, MeTMS

Kovats' RI, non-polar column, custom temperature program

Data compiled by: NIST Mass Spectrometry Data Center, William E. Wallace, director

Column type CapillaryCapillaryCapillary
Active phase HP-5HP-5HP-5
Column length (m) 30.30.30.
Carrier gas HeHeHe
Substrate
Column diameter (mm) 0.250.250.25
Phase thickness (μm) 0.250.250.25
Program 60C (2min) => 30C/min => 240C => 0.5C/min => 250C => 30C/min => 280C(5min)60C (2min) => 30C/min => 240C => 0.5C/min => 250C => 30C/min => 280C(5min)60C (2min) => 30C/min => 240C => 0.5C/min => 250C => 30C/min => 280C(5min)
I 2711.2711.2711.
ReferenceNakayama, Nishijima, et al., 1998Nakayama, Nishijima, et al., 1998Nakayama, Nishijima, et al., 1998
Comment MSDC-RI MSDC-RI MSDC-RI

References

Nakayama, Nishijima, et al., 1998
Nakayama, M.; Nishijima, T.; Koshioka, M.; Yamane, H.; Owen, D.J.; Mander, L.N., Identification of GA113, GA114, GA115, and GA116, and further novel gibberellins in Raphanus sativus, Phytochemistry, 1998, 48, 4, 587-593, https://doi.org/10.1016/S0031-9422(98)00035-1 . [all data]