GA113, MeTMS

Kovats' RI, non-polar column, custom temperature program

View large format table.

Column type Active phase I Reference Comment
CapillaryHP-52899.Nakayama, Nishijima, et al., 199830. m/0.25 mm/0.25 μm, He; Program: 60C (2min) => 30C/min => 240C => 2C/min => 280C (5min)
CapillaryHP-52899.Nakayama, Nishijima, et al., 199830. m/0.25 mm/0.25 μm, He; Program: 60C (2min) => 30C/min => 240C => 2C/min => 280C (5min)

References

Nakayama, Nishijima, et al., 1998
Nakayama, M.; Nishijima, T.; Koshioka, M.; Yamane, H.; Owen, D.J.; Mander, L.N., Identification of GA113, GA114, GA115, and GA116, and further novel gibberellins in Raphanus sativus, Phytochemistry, 1998, 48, 4, 587-593, https://doi.org/10.1016/S0031-9422(98)00035-1 . [all data]