cis-Zeatin riboside, permethylated

Van Den Dool and Kratz RI, non-polar column, custom temperature program

Data compiled by: NIST Mass Spectrometry Data Center, William E. Wallace, director

Column type CapillaryCapillaryCapillary
Active phase BP-5BP-5BP-5
Column length (m) 25.25.25.
Carrier gas HeHeHe
Substrate
Column diameter (mm) 0.220.220.22
Phase thickness (μm) 0.250.250.25
Program 60C => 20C/min => 200C => 5C/min => 300C (5min)60C => 20C/min => 200C => 5C/min => 300C (5min)60C => 20C/min => 200C => 5C/min => 300C (5min)
I 3065.3065.3065.
ReferenceEmery, Leport, et al., 1998Emery, Leport, et al., 1998Emery, Leport, et al., 1998
Comment MSDC-RI MSDC-RI MSDC-RI

References

Emery, Leport, et al., 1998
Emery, R.J.N.; Leport, L.; Barton, J.E.; Turner, N.C.; Atkins, C.A., Cis-Isomers of cytokinins predominate in chickpea seeds throughout their development, Plant Physiol., 1998, 117, 4, 1515-1523, https://doi.org/10.1104/pp.117.4.1515 . [all data]