[13C]GA70, MeTMS

Van Den Dool and Kratz RI, non-polar column, custom temperature program

View large format table.

Column type Active phase I Reference Comment
CapillaryOV-12546.Davis, Kobayashi, et al., 199825. m/0.2 mm/0.25 μm, He; Program: 60C(2min) => 10min/C => 150C => 3C/min => 300C

Normal alkane RI, non-polar column, custom temperature program

View large format table.

Column type Active phase I Reference Comment
CapillaryDB-12540.Yamauchi, Oyama, et al., 1997Helium; Column length: 15. m; Column diameter: 0.258 mm; Program: 120 0C (2 min) 6 0C/min -> 216 0C (5 min) 8 0C/min -> 280 0C

References

Davis, Kobayashi, et al., 1998
Davis, G.; Kobayashi, M.; Phinney, B.O.; MacMillan, J.; Gaskin, P., The Metabolism of GA9 in maize (ZEA mays), Phytochemistry, 1998, 47, 4, 635-639, https://doi.org/10.1016/S0031-9422(97)87974-5 . [all data]

Yamauchi, Oyama, et al., 1997
Yamauchi, T.; Oyama, N.; Yamane, H.; Mirofushi, N.; Schraudoff, H.; Pour, M.; Seto, H.; Mander, L.N., Biosynthesis of GA73 Methyl Ester in Lygodium Ferns, Plant Physiol., 1997, 113, 773-778. [all data]