Loline

Normal alkane RI, non-polar column, temperature ramp

View large format table.

Column type Active phase I Reference Comment
CapillaryDB-11252.Tofern, Kaloga, et al., 1999He, 6. K/min; Column length: 30. m; Column diameter: 0.32 mm; Tstart: 70. C; Tend: 300. C
CapillaryDB-11250.Justus, Witte, et al., 1997He, 6. K/min; Column length: 30. m; Column diameter: 0.32 mm; Tstart: 100. C; Tend: 300. C

References

Tofern, Kaloga, et al., 1999
Tofern, B.; Kaloga, M.; Witte, L.; Hartmann, T.; Eich, E., Occurrence of loline alkaloids in Argyreia mollis (Convolvulaceae), Phytochemistry, 1999, 51, 8, 1177-1180, https://doi.org/10.1016/S0031-9422(99)00121-1 . [all data]

Justus, Witte, et al., 1997
Justus, M.; Witte, L.; Hartmann, T., Levels and tissue distribution of loline alkaloids in endophyte-infected Festuca pratensis, Phytochemistry, 1997, 44, 1, 51-57, https://doi.org/10.1016/S0031-9422(96)00535-3 . [all data]