GA101, MeTMS

Van Den Dool and Kratz RI, non-polar column, custom temperature program

View large format table.

Column type Active phase I Reference Comment
CapillaryOV-12856.Owen, Mander, et al., 1996Program: 60C(2min) => 10C/min => 150C => 3C/min => 300C(10min)
CapillaryOV-12865.Owen, Mander, et al., 1996Program: 60C(2min) => 10C/min => 150C => 3C/min => 300C(10min)

References

Owen, Mander, et al., 1996
Owen, D.J.; Mander, L.N.; Gaskin, P.; Macmillan, J., Synthesis and confirmation of structure of three 13,15β-dihydroxy C-20 gibberellins, GA100, GA101 and GA102 isolated from the seeds of Helianthus annuus L., Phytochemistry, 1996, 42, 4, 921-925, https://doi.org/10.1016/0031-9422(96)00045-3 . [all data]