GA95, MeTMS

Kovats' RI, non-polar column, custom temperature program

View large format table.

Column type Active phase I Reference Comment
CapillaryDB-12505.Nakayama, Yokota, et al., 1996He; Column length: 15. m; Column diameter: 0.258 mm; Program: 130C (2min) => 32C/min => 220C (4min) => 8C/min => 270C (5min)
CapillaryDB-12490.Nakayama, Yokota, et al., 1996He; Column length: 15. m; Column diameter: 0.258 mm; Program: 130C (2min) => 32C/min => 220C (4min) => 8C/min => 270C (5min)

Normal alkane RI, non-polar column, custom temperature program

View large format table.

Column type Active phase I Reference Comment
CapillaryDB-12501.Nakayama, Koshioka, et al., 200130. m/0.25 mm/0.25 μm, He; Program: 60C (2min) => 30C/min => 225C => 0.5C/min => 280C(5min)

References

Nakayama, Yokota, et al., 1996
Nakayama, M.; Yokota, T.; Sohma, R.; Mander, L.N.; Twitchin, B.; Komatsu, H.; Matsui, H.; Bukovac, M.J., Gibberellins in immature seed of Prunus cerasus: structure determination and synthesis of gibberellin, GA95 (1,2-didehydro-GA20), Phytochemistry, 1996, 42, 4, 913-920, https://doi.org/10.1016/0031-9422(96)00035-0 . [all data]

Nakayama, Koshioka, et al., 2001
Nakayama, M.; Koshioka, M.; Matsui, H.; Ohara, H.; Mander, L.N.; Leitch, S.K.; Twitchin, B.; Kraft-Klaunzer, P.; Pharis, R.P.; Yokota, T., Endogenous gibberellins in immature seeds of Prunus persica L.: identification of GA118, GA119, GA120, GA121, GA122 and GA126, Phytochemistry, 2001, 57, 5, 749-758, https://doi.org/10.1016/S0031-9422(01)00154-6 . [all data]