5-α-Pregnan-3-α,20-α-diol, TMS

Normal alkane RI, non-polar column, custom temperature program

Data compiled by: NIST Mass Spectrometry Data Center, William E. Wallace, director

Column type CapillaryCapillaryCapillaryCapillaryCapillary
Active phase Methyl SiliconeMethyl SiliconeCross-Linked MethylsiliconeCross-Linked MethylsiliconePolydimethyl siloxane
Column length (m)  25.25.25.
Carrier gas
Substrate
Column diameter (mm)  0.320.320.32
Phase thickness (μm)  0.250.320.32
Program not specified60 0C 30 K/min -> 210 0C (1.5 min) 2.5 K/min -> 320 0C (20 min)60C => 30C/min => 210C (1.5min) => 2.5C/min => 320C (20min)60C => 30C/min => 210C (1.5min) => 2.5C/min => 320C (20min)not specified
I 2754.2754.2770.2772.2786.
ReferenceMeng, Reyes, et al., 1997Meng and Sjövall, 1997Meng, Griffiths, et al., 1996Meng, Griffiths, et al., 1996Vandenheuvel, 1975
Comment MSDC-RI MSDC-RI MSDC-RI MSDC-RI MSDC-RI

References

Meng, Reyes, et al., 1997
Meng, L.-J.; Reyes, H.; Palma, J.; Hernandez, I.; Ribalta, J.; Sjövall, J., Profiles of bile acids and progesterone metabolites in the urine and serum of women with intrahepatic cholestasis of pregnancy, J. Hepatol., 1997, 27, 2, 346-357, https://doi.org/10.1016/S0168-8278(97)80181-X . [all data]

Meng and Sjövall, 1997
Meng, L.-J.; Sjövall, J., Method for combined analysis of profiles of conjugated progesterone metabolites and bile acids in serum and urine of pregnant women, J. Chromatogr. B, 1997, 688, 1, 11-26, https://doi.org/10.1016/S0378-4347(97)88051-6 . [all data]

Meng, Griffiths, et al., 1996
Meng, L.J.; Griffiths, W.J.; Sjövall, J., The identification of novel steroid N-acetylglucosaminides in the urine of pregnant women, J. Steroid Biochem., 1996, 58, 5/6, 585-598, https://doi.org/10.1016/0960-0760(96)00080-5 . [all data]

Vandenheuvel, 1975
Vandenheuvel, F.A., Gas-liquid chromatographic studies of reactions and structural relationships of steroids, J. Chromatogr., 1975, 103, 1, 113-134, https://doi.org/10.1016/S0021-9673(00)83806-6 . [all data]