(Z)-9-Dodecenal

Van Den Dool and Kratz RI, non-polar column, temperature ramp

View large format table.

Column type Active phase I Reference Comment
CapillaryDB-51407.Marques, McElfresh, et al., 200030. m/0.25 mm/0.25 μm, 100. C @ 1. min, 5. K/min, 275. C @ 3. min

Van Den Dool and Kratz RI, non-polar column, custom temperature program

View large format table.

Column type Active phase I Reference Comment
CapillaryDB-51409.Sasaerila, Gries, et al., 2000Column length: 30. m; Program: not specified

Van Den Dool and Kratz RI, polar column, temperature ramp

View large format table.

Column type Active phase I Reference Comment
CapillaryDB-Wax1752.Marques, McElfresh, et al., 200030. m/0.32 mm/0.25 μm, 100. C @ 1. min, 5. K/min; Tend: 240. C

Normal alkane RI, non-polar column, temperature ramp

View large format table.

Column type Active phase I Reference Comment
CapillaryDB-51410.Sasaerila, Gries, et al., 199730. m/0.25 mm/0.32 μm, 10. K/min; Tstart: 50. C; Tend: 200. C

References

Marques, McElfresh, et al., 2000
Marques, F.A.; McElfresh, J.S.; Millar, J.G., Kováts retention indexes of monounsaturated C12, C14, and C16 alcohols, acetates and aldehydes commonly found in lepidopteran pheromone blends, J. Braz. Chem. Soc., 2000, 11, 6, 592-599, https://doi.org/10.1590/S0103-50532000000600007 . [all data]

Sasaerila, Gries, et al., 2000
Sasaerila, Y.; Gries, R.; Gries, G.; Khaskin, G.; Hardi, Sex pheromone components of nettle caterpillar, Setora nitens, J. Chem. Ecol., 2000, 26, 8, 1983-1990, https://doi.org/10.1023/A:1005513211225 . [all data]

Sasaerila, Gries, et al., 1997
Sasaerila, Y.; Gries, G.; Khaskin, G.; Gries, R.; Hardi, Identification of sex pheromone components of nettle caterpillar, Setothosea asigna, J. Chem. Ecol., 1997, 23, 9, 2187-2196, https://doi.org/10.1023/B:JOEC.0000006438.03728.1a . [all data]