(Z)-6-Decenal

Normal alkane RI, non-polar column, custom temperature program

View large format table.

Column type Active phase I Reference Comment
CapillaryDB-51203.Acree and Arn, 2004Program: not specified

References

Acree and Arn, 2004
Acree, T.; Arn, H., Flavornet, 2004, retrieved from http://www.flavornet.org/. [all data]