(E)-3-Decenal

Normal alkane RI, polar column, custom temperature program

View large format table.

Column type Active phase I Reference Comment
CapillaryHP-Innowax1548.Narain, Galvao, et al., 200730. m/0.25 mm/0.25 μm, Helium; Program: 30 0C (5 min) 5 0C/min -> 100 0C (5 min) 1 0C/min -> 130 0C 10 0C/min -> 195 0C (45 min)

References

Narain, Galvao, et al., 2007
Narain, N.; Galvao, M. deS.; Ferreira, D.DaS.; Navarro, D.M.A.F., Flavor biogeneration in Mangaba (Hancornia speciosa Gomes) fruit, BioEng. Campinas, 2007, 1, 1, 25-31. [all data]