Albine

Normal alkane RI, non-polar column, custom temperature program

Data compiled by: NIST Mass Spectrometry Data Center, William E. Wallace, director

Column type CapillaryCapillary
Active phase DB-1DB-1
Column length (m) 15.30.
Carrier gas Helium
Substrate
Column diameter (mm) 0.3170.3
Phase thickness (μm)
Program 150 0C (2 min) 15 0C/min -> 250 0C 25 0C/min -> 300 0C (5 min)not specified
I 1900.1900.
ReferenceEl-Shazly, Ateya, et al., 2001Wink, Meissner, et al., 1995
Comment MSDC-RI MSDC-RI

References

El-Shazly, Ateya, et al., 2001
El-Shazly, A.; Ateya, A.-M.M.; Wink, M., Quinolizidine alkaloid profiles of lupunus varius orientalis. L. albus albus, L. hartwegii, and L. densiflorus, Z. Naturforsch., 2001, 56c, 21-30. [all data]

Wink, Meissner, et al., 1995
Wink, M.; Meissner, C.; Witte, L., Patterns of quinolizidine alkaloids in 56 species of the genus Lupinus, Phytochemistry, 1995, 38, 1, 139-153, https://doi.org/10.1016/0031-9422(95)91890-D . [all data]