3β-Hydroxylupanine

Normal alkane RI, non-polar column, temperature ramp

View large format table.

Column type Active phase I Reference Comment
CapillaryDB-52255.Przybylak, Ciesiolka, et al., 2005He, 180. C @ 2. min, 5. K/min, 300. C @ 10. min; Column length: 30. m; Column diameter: 0.25 mm
CapillaryDB-12250.Greinwald, Reyes-Chilpa, et al., 1996He, 6. K/min; Column length: 30. m; Column diameter: 0.32 mm; Tstart: 150. C; Tend: 300. C

Normal alkane RI, non-polar column, custom temperature program

View large format table.

Column type Active phase I Reference Comment
CapillaryDB-12260.El-Shazly, Ateya, et al., 2001Helium; Column length: 15. m; Column diameter: 0.317 mm; Program: 150 0C (2 min) 15 0C/min -> 250 0C 25 0C/min -> 300 0C (5 min)
CapillaryDB-12250.Wink, Meissner, et al., 1995Column length: 30. m; Column diameter: 0.3 mm; Program: not specified

References

Przybylak, Ciesiolka, et al., 2005
Przybylak, J.K.; Ciesiolka, D.; Wysocka, W.; García-López, P.M.; Ruiz-López, M.A.; Wysocki, W.; Gulewicz, K., Alkaloid profiles of Mexican wild lupin and an effect of alkaloid preparation from Lupinus exaltatus seeds on growth and yield of paprika (Capsicum annuum L.), Ind. Crops Prod., 2005, 21, 1, 1-7, https://doi.org/10.1016/j.indcrop.2003.12.001 . [all data]

Greinwald, Reyes-Chilpa, et al., 1996
Greinwald, R.; Reyes-Chilpa, R.; Ross, J.H.; Witte, L.; Czygan, F.-C., A survey of alkaloids in the genera Harpalyce and Brongniartia (Fabaceae - Brongniartieae), Biochem. Syst. Ecol., 1996, 24, 7/8, 749-755. [all data]

El-Shazly, Ateya, et al., 2001
El-Shazly, A.; Ateya, A.-M.M.; Wink, M., Quinolizidine alkaloid profiles of lupunus varius orientalis. L. albus albus, L. hartwegii, and L. densiflorus, Z. Naturforsch., 2001, 56c, 21-30. [all data]

Wink, Meissner, et al., 1995
Wink, M.; Meissner, C.; Witte, L., Patterns of quinolizidine alkaloids in 56 species of the genus Lupinus, Phytochemistry, 1995, 38, 1, 139-153, https://doi.org/10.1016/0031-9422(95)91890-D . [all data]