13-Tigloyloxymultiflorine

Normal alkane RI, non-polar column, temperature ramp

Data compiled by: NIST Mass Spectrometry Data Center, William E. Wallace, director

Column type Capillary
Active phase DB-1
Column length (m) 30.
Carrier gas
Substrate
Column diameter (mm) 0.3
Phase thickness (μm)
Tstart (C) 150.
Tend (C) 270.
Heat rate (K/min) 6.
Initial hold (min)
Final hold (min)
I 2935.
ReferencePlanchuelo-Ravelo and Wink, 1993
Comment MSDC-RI

References

Planchuelo-Ravelo and Wink, 1993
Planchuelo-Ravelo, A.M.; Wink, M., Alkaloid composition of Lupinus-albescens (Fabaceae) from South America, Z. Naturforsch. C:, 1993, 48, 5-6, 414-416. [all data]