13α-Propanyloxylupanine

Normal alkane RI, non-polar column, custom temperature program

View large format table.

Column type Active phase I Reference Comment
CapillaryDB-12530.Wink, Meissner, et al., 1995Column length: 30. m; Column diameter: 0.3 mm; Program: not specified

References

Wink, Meissner, et al., 1995
Wink, M.; Meissner, C.; Witte, L., Patterns of quinolizidine alkaloids in 56 species of the genus Lupinus, Phytochemistry, 1995, 38, 1, 139-153, https://doi.org/10.1016/0031-9422(95)91890-D . [all data]