(8Z,11Z,14Z)-Heptadecatrienal

Normal alkane RI, non-polar column, temperature ramp

View large format table.

Column type Active phase I Reference Comment
CapillaryOV-1011852.Tamura, Nakamoto, et al., 1995N2, 2. K/min; Column length: 50. m; Column diameter: 0.25 mm; Tstart: 80. C; Tend: 200. C
CapillaryOV-1011864.Sugisawa, Nakamura, et al., 1990Nitrogen, 2. K/min; Column length: 50. m; Column diameter: 0.25 mm; Tstart: 70. C; Tend: 200. C

Normal alkane RI, non-polar column, custom temperature program

View large format table.

Column type Active phase I Reference Comment
CapillarySF-961874.Kawasaki, Matsui, et al., 1998Column length: 40. m; Column diameter: 0.28 mm; Program: 75C => 3C/min => 190C(25min) => 3C/min => 210C

References

Tamura, Nakamoto, et al., 1995
Tamura, H.; Nakamoto, H.; Yang, R.-H.; Sugisawa, H., Characteristic aroma compounds in green algae (Ulva pertusa) volatiles, Nippon Shokuhin Kagaku Kogaku Kaishi, 1995, 42, 11, 887-891, https://doi.org/10.3136/nskkk.42.887 . [all data]

Sugisawa, Nakamura, et al., 1990
Sugisawa, H.; Nakamura, K.; Tamura, H., The aroma profile of the volatile in marine green algae (Ulva pertusa), Food Reviews International, 1990, 6, 4, 573-589, https://doi.org/10.1080/87559129009540893 . [all data]

Kawasaki, Matsui, et al., 1998
Kawasaki, W.; Matsui, K.; Akakabe, Y.; Itai, N.; Kajiwara, T., Long-chain aldehyde-forming activity in tobacco leaves, Phytochemistry, 1998, 49, 6, 1565-1568, https://doi.org/10.1016/S0031-9422(98)00236-2 . [all data]