5,13-dimethyl-heptacosane

Normal alkane RI, non-polar column, temperature ramp

Data compiled by: NIST Mass Spectrometry Data Center, William E. Wallace, director

Column type Capillary
Active phase BP-1
Column length (m) 25.
Carrier gas Helium
Substrate
Column diameter (mm) 0.25
Phase thickness (μm) 0.25
Tstart (C) 160.
Tend (C) 300.
Heat rate (K/min) 1.5
Initial hold (min)
Final hold (min)
I 2761.
ReferenceLockey and Dularay, 1986
Comment MSDC-RI

References

Lockey and Dularay, 1986
Lockey, K.H.; Dularay, B., Cuticular methylalkanes of adult cockroaches, Blatta orientalis and Periplaneta Americana, Comp. Biochem. Physiol., 1986, 85B, 3, 567-572. [all data]