3,9-dimethyltritriacontane

Van Den Dool and Kratz RI, non-polar column, temperature ramp

View large format table.

Column type Active phase I Reference Comment
CapillaryHT-53401.Goh S.H., Ooi K.E., et al., 199325. m/0.53 mm/0.22 μm, N2, 15. K/min, 320. C @ 20. min; Tstart: 150. C
CapillaryHT-53404.Goh S.H., Ooi K.E., et al., 199325. m/0.53 mm/0.22 μm, N2, 15. K/min, 320. C @ 20. min; Tstart: 150. C

Van Den Dool and Kratz RI, non-polar column, custom temperature program

View large format table.

Column type Active phase I Reference Comment
CapillaryDB-13410.Bernier, Carlson, et al., 199830. m/0.32 mm/0.25 μm; Program: 60C (2min) => 10C/min => 220C => 3C/min => 310C

Normal alkane RI, non-polar column, temperature ramp

View large format table.

Column type Active phase I Reference Comment
CapillaryDB-13403.Katritzky, Chen, et al., 200030. m/0.32 mm/0.25 μm; Tstart: 60. C; Tend: 320. C

Normal alkane RI, non-polar column, custom temperature program

View large format table.

Column type Active phase I Reference Comment
CapillaryPolydimethyl siloxane3403.Junkes, Castanho, et al., 2003Program: not specified
CapillaryDB-13410.Carlson, Geden, et al., 199930. m/0.32 mm/0.25 μm, He; Program: 60C (2min) => 10C/min => 220C => 3C/min => 310C (12 - 42 min)
CapillaryCP Sil 5 CB3406.Kenig, Sinninghe Damsté, et al., 199525. m/0.32 mm/0.2 μm, He; Program: 50C => 20C/min => 130C => 4C/min => 300C (20min)

References

Goh S.H., Ooi K.E., et al., 1993
Goh S.H.; Ooi K.E.; Chuah C.H.; Yong H.S.; Khoo S.G.; Ong S.H., Cuticular hydrocarbons from two species of Malaysian Bactrocera fruit flies, Biochem. Syst. Ecol., 1993, 21, 2, 215-226, https://doi.org/10.1016/0305-1978(93)90039-T . [all data]

Bernier, Carlson, et al., 1998
Bernier, U.R.; Carlson, D.A.; Geden, C.J., Gas chromatography/mass spectrometry analysis of the cuticular hydrocarbons from parasitic wasps of the genus Muscidifurax, J. Am. Soc. Mass Spectrom., 1998, 9, 4, 320-332, https://doi.org/10.1016/S1044-0305(97)00288-2 . [all data]

Katritzky, Chen, et al., 2000
Katritzky, A.R.; Chen, K.; Maran, U.; Carlson, D.A., QSPR Correlation and predictions of GC retention indexes for methyl-branched hydrocarbons produced by insects, Anal. Chem., 2000, 72, 1, 101-109, https://doi.org/10.1021/ac990800w . [all data]

Junkes, Castanho, et al., 2003
Junkes, B.S.; Castanho, R.D.M.; Amboni, C.; Yunes, R.A.; Heinzen, V.E.F., Semiempirical Topological Index: A Novel Molecular Descriptor for Quantitative Structure-Retention Relationship Studies, Internet Electronic Journal of Molecular Design, 2003, 2, 1, 33-49. [all data]

Carlson, Geden, et al., 1999
Carlson, D.A.; Geden, C.J.; Bernier, U.R., Identification of pupal exiviae of Nasania vitripennis and Muscidifurax raptorellus parasitoids using cuticular hydrocarbons, Biol. Control, 1999, 15, 2, 97-106, https://doi.org/10.1006/bcon.1999.0708 . [all data]

Kenig, Sinninghe Damsté, et al., 1995
Kenig, F.; Sinninghe Damsté, J.S.; Kock-van Dalen, A.C.; Rijpstra, W.I.C.; Huc, A.Y.; de Leeuw, J.W., Occurrence and origin of mono-, di-, and trimethylalkanes in modern and holocene cyanobacterial mats from Abu Dhabi, United Arab Emirates, Geochim. Cosmochim. Acta, 1995, 59, 14, 2999-3015, https://doi.org/10.1016/0016-7037(95)00190-5 . [all data]