13-Methylpentatriacontane

Normal alkane RI, non-polar column, custom temperature program

Data compiled by: NIST Mass Spectrometry Data Center, William E. Wallace, director

Column type CapillaryCapillary
Active phase DB-1CP Sil 5 CB
Column length (m) 30.25.
Carrier gas HeHe
Substrate
Column diameter (mm) 0.320.32
Phase thickness (μm) 0.250.2
Program 60C (2min) => 10C/min => 220C => 3C/min => 310C (12 - 42 min)50C => 20C/min => 130C => 4C/min => 300C (20min)
I 3535.3529.
ReferenceCarlson, Geden, et al., 1999Kenig, Sinninghe Damsté, et al., 1995
Comment MSDC-RI MSDC-RI

Van Den Dool and Kratz RI, non-polar column, temperature ramp

View large format table.

Column type Active phase I Reference Comment
CapillaryDB-5MS3530.Steiner, Steidle, et al., 200530. m/0.32 mm/0.25 μm, He, 2. K/min; Tstart: 150. C; Tend: 300. C
CapillaryUltra-13526.Nelson, Adams, et al., 2003150. C @ 4. min, 4. K/min, 320. C @ 30. min; Column length: 12. m; Column diameter: 0.2 mm
CapillaryHT-53523.Goh S.H., Ooi K.E., et al., 199325. m/0.53 mm/0.22 μm, N2, 15. K/min, 320. C @ 20. min; Tstart: 150. C
CapillaryHT-53524.Goh S.H., Ooi K.E., et al., 199325. m/0.53 mm/0.22 μm, N2, 15. K/min, 320. C @ 20. min; Tstart: 150. C

Van Den Dool and Kratz RI, non-polar column, custom temperature program

View large format table.

Column type Active phase I Reference Comment
CapillaryDB-13535.Bernier, Carlson, et al., 199830. m/0.32 mm/0.25 μm; Program: 60C (2min) => 10C/min => 220C => 3C/min => 310C

Normal alkane RI, non-polar column, temperature ramp

View large format table.

Column type Active phase I Reference Comment
CapillaryUltra-13526.Nelson and Charlet, 2003He, 4. K/min; Column length: 12.5 m; Column diameter: 0.2 mm; Tstart: 150. C; Tend: 320. C
CapillaryBP-13527.Lockey and Oraha, 199012. m/0.22 mm/0.25 μm, Helium, 2. K/min; Tstart: 100. C; Tend: 300. C
PackedOV-1013530.Nelson, de Renobales, et al., 1989Helium, Gas-Chrom Q (100-120 mesh), 3. K/min, 320. C @ 25. min; Column length: 3. m; Tstart: 150. C
PackedDexsil 3003533.Lockey, 1976Nitrogen, Chromosorb W (80-100 mesh), 3.3 K/min; Column length: 2. m; Tstart: 80. C; Tend: 340. C
PackedDexsil 3003533.Lockey, 1976Nitrogen, Chromosorb W (80-100 mesh), 3.3 K/min; Column length: 2. m; Tstart: 80. C; Tend: 340. C

References

Carlson, Geden, et al., 1999
Carlson, D.A.; Geden, C.J.; Bernier, U.R., Identification of pupal exiviae of Nasania vitripennis and Muscidifurax raptorellus parasitoids using cuticular hydrocarbons, Biol. Control, 1999, 15, 2, 97-106, https://doi.org/10.1006/bcon.1999.0708 . [all data]

Kenig, Sinninghe Damsté, et al., 1995
Kenig, F.; Sinninghe Damsté, J.S.; Kock-van Dalen, A.C.; Rijpstra, W.I.C.; Huc, A.Y.; de Leeuw, J.W., Occurrence and origin of mono-, di-, and trimethylalkanes in modern and holocene cyanobacterial mats from Abu Dhabi, United Arab Emirates, Geochim. Cosmochim. Acta, 1995, 59, 14, 2999-3015, https://doi.org/10.1016/0016-7037(95)00190-5 . [all data]