13,17-Dimethylpentatriacontane

Normal alkane RI, non-polar column, custom temperature program

Data compiled by: NIST Mass Spectrometry Data Center, William E. Wallace, director

Column type CapillaryCapillaryCapillaryCapillary
Active phase DB-1CP Sil 5 CBDexsil 300Dexsil 300
Column length (m) 30.25.15.15.
Carrier gas HeHe
Substrate
Column diameter (mm) 0.320.32
Phase thickness (μm) 0.250.2
Program 60C (2min) => 10C/min => 220C => 3C/min => 310C (12 - 42 min)50C => 20C/min => 130C => 4C/min => 300C (20min)50 0C 5 0C/min -> 200 0C 2 0C/min -> 340 0C50 0C 5 0C/min -> 200 0C 2 0C/min -> 340 0C
I 3555.3560.3548.3556.
ReferenceCarlson, Geden, et al., 1999Kenig, Sinninghe Damsté, et al., 1995Lockey, 1981Lockey, 1981
Comment MSDC-RI MSDC-RI MSDC-RI MSDC-RI

Normal alkane RI, non-polar column, temperature ramp

Data compiled by: NIST Mass Spectrometry Data Center, William E. Wallace, director

Column type CapillaryPacked
Active phase BP-1OV-101
Column length (m) 12.3.
Carrier gas HeliumHelium
Substrate  Gas-Chrom Q (100-120 mesh)
Column diameter (mm) 0.22
Phase thickness (μm) 0.25
Tstart (C) 100.150.
Tend (C) 300.320.
Heat rate (K/min) 2.3.
Initial hold (min)
Final hold (min)  25.
I 3555.3559.
ReferenceLockey and Oraha, 1990Nelson, de Renobales, et al., 1989
Comment MSDC-RI MSDC-RI

References

Carlson, Geden, et al., 1999
Carlson, D.A.; Geden, C.J.; Bernier, U.R., Identification of pupal exiviae of Nasania vitripennis and Muscidifurax raptorellus parasitoids using cuticular hydrocarbons, Biol. Control, 1999, 15, 2, 97-106, https://doi.org/10.1006/bcon.1999.0708 . [all data]

Kenig, Sinninghe Damsté, et al., 1995
Kenig, F.; Sinninghe Damsté, J.S.; Kock-van Dalen, A.C.; Rijpstra, W.I.C.; Huc, A.Y.; de Leeuw, J.W., Occurrence and origin of mono-, di-, and trimethylalkanes in modern and holocene cyanobacterial mats from Abu Dhabi, United Arab Emirates, Geochim. Cosmochim. Acta, 1995, 59, 14, 2999-3015, https://doi.org/10.1016/0016-7037(95)00190-5 . [all data]

Lockey, 1981
Lockey, K.H., Cuticular hydrocarbons of adult Cylindrinotus laevioctostriatus (Goeze) and Phylan gibbus (Fabricius) (Coleoptera: Tenebrionidae), Insect. Biochem., 1981, 11, 5, 549-561, https://doi.org/10.1016/0020-1790(81)90023-8 . [all data]