3,4-Dimethyl-2,5-dihidrothiophene

Normal alkane RI, non-polar column, temperature ramp

View large format table.

Column type Active phase I Reference Comment
CapillaryDB-11213.Hanum, Sinha, et al., 199530. m/0.25 mm/0.25 μm, He, 5. K/min; Tstart: 35. C; Tend: 150. C

References

Hanum, Sinha, et al., 1995
Hanum, T.; Sinha, N.K.; Guyer, D.E.; Cash, J.N., Pyruvate and flavor development in macerated onions (Allium cepa L.) by γ-glutamyl transpeptidase and exogenous C-S lyase, Food Chem., 1995, 54, 2, 183-188, https://doi.org/10.1016/0308-8146(95)00027-G . [all data]