14-hydroxysparteine

Normal alkane RI, non-polar column, temperature ramp

View large format table.

Column type Active phase I Reference Comment
CapillaryDB-12055.Beuerle, 2010He, 6. K/min; Column length: 30. m; Column diameter: 0.32 mm; Tstart: 150. C; Tend: 300. C
CapillaryDB-12060.Greinwald, Canto, et al., 1992He, 6. K/min; Column length: 30. m; Column diameter: 0.32 mm; Tstart: 150. C; Tend: 300. C

Normal alkane RI, non-polar column, custom temperature program

View large format table.

Column type Active phase I Reference Comment
CapillaryDB-12052.Greinwald, Ross, et al., 1996He; Column length: 15. m; Column diameter: 0.25 mm; Program: 150C(2min) => 10C/min => 250C => 20C/min => 300C (10min)
CapillaryDB-12050.Greinwald, Ross, et al., 1995He; Column length: 30. m; Column diameter: 0.32 mm; Program: 150C (2min) => 10C/min => 250C => 20C/min => 300C (5min)

References

Beuerle, 2010
Beuerle, T., MS and RI data. Personal communication., 2010. [all data]

Greinwald, Canto, et al., 1992
Greinwald, R.; Canto, P.; Bachmann, P.; Witte, L.; Czygan, F.-C., Distribution and taxdonomic significance of alkaloids in the Genista cinerea agregat, Biochem. Syst. Ecol., 1992, 20, 1, 75-81, https://doi.org/10.1016/0305-1978(92)90074-N . [all data]

Greinwald, Ross, et al., 1996
Greinwald, R.; Ross, J.H.; Witte, L.; Czygan, F.-C., Alkaloids of Templetonia incana, Biochem. Syst. Ecol., 1996, 24, 5, 423-426, https://doi.org/10.1016/0305-1978(96)00024-5 . [all data]

Greinwald, Ross, et al., 1995
Greinwald, R.; Ross, J.H.; Witte, L.; Czygan, F.-C., The alkaloid pattern of Plagiocarpus axillaris (Fabaceae: Brongniartieae), Biochem. Syst. Ecol., 1995, 23, 6, 645-648, https://doi.org/10.1016/0305-1978(95)00059-3 . [all data]