13-Methylbutyryloxy-lupanine

Normal alkane RI, non-polar column, custom temperature program

View large format table.

Column type Active phase I Reference Comment
CapillaryDB-12655.Greinwald, van Rensen, et al., 1995He; Column length: 30. m; Column diameter: 0.32 mm; Program: 150C (2min) => 10C/min => 250C => 20C/min => 300C (5min)

References

Greinwald, van Rensen, et al., 1995
Greinwald, R.; van Rensen, I.; Veit, M.; Canto, P.; Witte, L., A chemical dichotomy in quinolizidine alkaloid accumulation within the section Spartioides of the genus Genista (Fabaceae: Genisteae), Biochem. Syst. Ecol., 1995, 23, 1, 89-97, https://doi.org/10.1016/0305-1978(95)93662-M . [all data]