N-acetylcytisine

Normal alkane RI, non-polar column, custom temperature program

Data compiled by: NIST Mass Spectrometry Data Center, William E. Wallace, director

Column type CapillaryCapillaryCapillaryCapillaryCapillary
Active phase OV-1DB-1DB-1DB-1DB-1
Column length (m) 15.15.30.30.30.
Carrier gas HeHeHeHe
Substrate
Column diameter (mm) 0.250.250.320.320.3
Phase thickness (μm)
Program 120C (2min) => 10C/min => 250C => 15C/min => 300C150C(2min) => 10C/min => 250C => 20C/min => 300C (10min)150C (2min) => 10C/min => 250C => 20C/min => 300C (5min)150C (2min) => 10C/min => 250C => 20C/min => 300C (5min)not specified
I 2344.2325.2320.2325.2325.
ReferenceAsres, Tei, et al., 1997Greinwald, Ross, et al., 1996Greinwald, van Rensen, et al., 1995Greinwald, Ross, et al., 1995Wink, Meissner, et al., 1995
Comment MSDC-RI MSDC-RI MSDC-RI MSDC-RI MSDC-RI

References

Asres, Tei, et al., 1997
Asres, K.; Tei, A.; Wink, M., Quinolizidine alkaloids from the East-African legume Dicraeopetalum stipulare harms, Biochem. Syst. Ecol., 1997, 25, 4, 305-308, https://doi.org/10.1016/S0305-1978(97)00004-5 . [all data]

Greinwald, Ross, et al., 1996
Greinwald, R.; Ross, J.H.; Witte, L.; Czygan, F.-C., Alkaloids of Templetonia incana, Biochem. Syst. Ecol., 1996, 24, 5, 423-426, https://doi.org/10.1016/0305-1978(96)00024-5 . [all data]

Greinwald, van Rensen, et al., 1995
Greinwald, R.; van Rensen, I.; Veit, M.; Canto, P.; Witte, L., A chemical dichotomy in quinolizidine alkaloid accumulation within the section Spartioides of the genus Genista (Fabaceae: Genisteae), Biochem. Syst. Ecol., 1995, 23, 1, 89-97, https://doi.org/10.1016/0305-1978(95)93662-M . [all data]

Greinwald, Ross, et al., 1995
Greinwald, R.; Ross, J.H.; Witte, L.; Czygan, F.-C., The alkaloid pattern of Plagiocarpus axillaris (Fabaceae: Brongniartieae), Biochem. Syst. Ecol., 1995, 23, 6, 645-648, https://doi.org/10.1016/0305-1978(95)00059-3 . [all data]

Wink, Meissner, et al., 1995
Wink, M.; Meissner, C.; Witte, L., Patterns of quinolizidine alkaloids in 56 species of the genus Lupinus, Phytochemistry, 1995, 38, 1, 139-153, https://doi.org/10.1016/0031-9422(95)91890-D . [all data]