3-ethylfuro[2,3-h]quinoline

Van Den Dool and Kratz RI, non-polar column, temperature ramp

View large format table.

Column type Active phase I Reference Comment
CapillarySE-522145.Dziwinski, Cote, et al., 199525. m/0.2 mm/0.2 μm, He, 10. K/min; Tstart: 70. C; Tend: 290. C
CapillarySE-522146.Dziwinski, Cote, et al., 199525. m/0.2 mm/0.2 μm, He, 10. K/min; Tstart: 70. C; Tend: 290. C

References

Dziwinski, Cote, et al., 1995
Dziwinski, E.; Cote, G.; Bauer, D.; Szymanowski, J., Composition of KELEX 100, KELEX 100S and KELEX 108: a discussion on the role of impurities, Hydrometallurgy, 1995, 37, 2, 243-250, https://doi.org/10.1016/0304-386X(94)00022-U . [all data]