α-Aminobutyric acid, N-isoBOC TBDMS

Normal alkane RI, non-polar column, temperature ramp

View large format table.

Column type Active phase I Reference Comment
CapillaryDB-51768.Oh, Kim, et al., 199430. m/0.25 mm/0.25 μm, 150. C @ 2. min, 3. K/min; Tend: 280. C

References

Oh, Kim, et al., 1994
Oh, C.-H.; Kim, J.-H.; Kim, K.-R.; Brownson, D.M.; Mabry, T.J., Simultaneous gas chromatographic analysis of non-protein and protein amino acids as N(O,S)-isobutyloxycarbonyl tert.-butyldimethylsilyl derivatives, J. Chromatogr. A, 1994, 669, 1-2, 125-137, https://doi.org/10.1016/0021-9673(94)80344-7 . [all data]