Decyl 2,4,6-trichlorophenyl ether

Van Den Dool and Kratz RI, non-polar column, temperature ramp

View large format table.

Column type Active phase I Reference Comment
CapillaryDB-52252.Morosini and Ballschmiter, 199425. m/0.25 mm/0.10 μm, H2, 90. C @ 3. min, 2.5 K/min, 270. C @ 5. min

References

Morosini and Ballschmiter, 1994
Morosini, M.; Ballschmiter, K., 2,4,6-Trichlorophenyl alkyl ethers as retention index markers in capillary gas chromatography with electron-capture and mass spectrometric detection, Anal. Chim. Acta., 1994, 286, 3, 451-456, https://doi.org/10.1016/0003-2670(94)85090-9 . [all data]