endo-GA37, methyl ester TMS

Normal alkane RI, non-polar column, custom temperature program

View large format table.

Column type Active phase I Reference Comment
CapillaryBP-12688.Lange, Hedden, et al., 199325. m/0.25 mm/0.33 μm, He; Program: 60C(1min) => 20C/min => 240C => 4C/min => 300C

References

Lange, Hedden, et al., 1993
Lange, T.; Hedden, P.; Graebe, J.E., Gibberellin biosynthesis in cell-free extracts from developing Cucurbita maxima embryos and the identification of new endogenous gibberellins, Planta, 1993, 189, 3, 350-358, https://doi.org/10.1007/BF00194431 . [all data]