16α,17-H2(OH)2 GA9, MeTMSi

Van Den Dool and Kratz RI, non-polar column, custom temperature program

View large format table.

Column type Active phase I Reference Comment
CapillarySE-522769.Hedden, Hoad, et al., 199325. m/0.22 mm/0.25 μm, He; Program: 50C => 15C/min => 240C => 4C/min => 300C
CapillarySE-522771.Hedden, Hoad, et al., 199325. m/0.22 mm/0.25 μm, He; Program: 50C => 15C/min => 240C => 4C/min => 300C

References

Hedden, Hoad, et al., 1993
Hedden, P.; Hoad, G.V.; Gaskin, P.; Lewis, M.J.; Green, J.R.; Furber, M.; Mander, L.N., Kaurenoids and gibberellins, including the newly characterized gibberellin A88, in developing apple seeds, Phytochemistry, 1993, 32, 2, 231-237, https://doi.org/10.1016/S0031-9422(00)94973-2 . [all data]