16α, 17-H2 (OH)2 GA12, MeTMS

Van Den Dool and Kratz RI, non-polar column, custom temperature program

View large format table.

Column type Active phase I Reference Comment
CapillaryOV-12789.Santes, Hedden, et al., 199525. m/0.2 mm/0.25 μm; Program: 60C(2min) => 10C/min => 150C => 3C/min => 300C
CapillaryOV-12789.Santes, Hedden, et al., 199525. m/0.2 mm/0.25 μm; Program: 60C(2min) => 10C/min => 150C => 3C/min => 300C
CapillarySE-522784.Hedden, Hoad, et al., 199325. m/0.22 mm/0.25 μm, He; Program: 50C => 15C/min => 240C => 4C/min => 300C
CapillarySE-522785.Hedden, Hoad, et al., 199325. m/0.22 mm/0.25 μm, He; Program: 50C => 15C/min => 240C => 4C/min => 300C

Normal alkane RI, non-polar column, custom temperature program

View large format table.

Column type Active phase I Reference Comment
CapillaryOV-12780.Yamane, Fujioka, et al., 198825. m/0.20 mm/0.25 μm; Program: not specified

References

Santes, Hedden, et al., 1995
Santes, C.M.; Hedden, P.; Gaskin, P.; Garcia-Martinez, J.L., Gibberellins and related compounds in young fruits of pea and their relationship to fruit-set, Phytochemistry, 1995, 40, 5, 1347-1355, https://doi.org/10.1016/0031-9422(95)00489-T . [all data]

Hedden, Hoad, et al., 1993
Hedden, P.; Hoad, G.V.; Gaskin, P.; Lewis, M.J.; Green, J.R.; Furber, M.; Mander, L.N., Kaurenoids and gibberellins, including the newly characterized gibberellin A88, in developing apple seeds, Phytochemistry, 1993, 32, 2, 231-237, https://doi.org/10.1016/S0031-9422(00)94973-2 . [all data]

Yamane, Fujioka, et al., 1988
Yamane, H.; Fujioka, S.; Spray, C.R.; Phinney, B.O.; MacMillan, J.; Gaskin, P.; Takahashi, N., Endogenous Gibberellines from Sporophytes of Two Tree Ferns, Cibotium glaucum and Dicksonia antarctica, Plant Phisiol., 1988, 86, 3, 857-862, https://doi.org/10.1104/pp.86.3.857 . [all data]