benzaldehyde oxime, 2-hydroxy, 3-chloro, 5-(1,1,3,3-tetramethylbutyl)

Van Den Dool and Kratz RI, non-polar column, temperature ramp

Data compiled by: NIST Mass Spectrometry Data Center, William E. Wallace, director

Column type Packed
Active phase SE-30
Column length (m) 2.
Carrier gas
Substrate GasChrom Q
Column diameter (mm)
Phase thickness (μm)
Tstart (C) 80.
Tend (C) 250.
Heat rate (K/min) 4.
Initial hold (min)
Final hold (min)
I 2105.
ReferenceStaniewski, 1991
Comment MSDC-RI

References

Staniewski, 1991
Staniewski, J., Gas chromatographic analysis of some hydroxyoxime extractants of metals, Chem. Anal. (Warsaw), 1991, 36, 2, 325-333. [all data]