phenethyl ester

Normal alkane RI, non-polar column, temperature ramp

Data compiled by: NIST Mass Spectrometry Data Center, William E. Wallace, director

Column type Capillary
Active phase HP-5
Column length (m) 50.
Carrier gas H2
Substrate
Column diameter (mm) 0.3
Phase thickness (μm)
Tstart (C) 80.
Tend (C) 250.
Heat rate (K/min) 16.
Initial hold (min)
Final hold (min)
I 1502.
ReferenceSpadone, Takeoka, et al., 1990
Comment MSDC-RI

References

Spadone, Takeoka, et al., 1990
Spadone, J.-C.; Takeoka, G.; Liardon, R., Analytical Investigation of Rio Off-Flavor in Green Coffee, J. Agric. Food Chem., 1990, 38, 1, 226-233, https://doi.org/10.1021/jf00091a050 . [all data]