Cyclohexene, 4-iodo-3-methyl

Normal alkane RI, non-polar column, custom temperature program

Data compiled by: NIST Mass Spectrometry Data Center, William E. Wallace, director

Column type Packed
Active phase SE-30
Column length (m) 3.05
Carrier gas He
Substrate Chromosorb AW
Column diameter (mm)
Phase thickness (μm)
Program not specified
I 1153.
ReferenceBuchman, Cao, et al., 1984
Comment MSDC-RI

References

Buchman, Cao, et al., 1984
Buchman, O.; Cao, G.-Y.; Peng, C.T., Structure assignment by retention index in gas-liquid radiochromatography of substituted cyclohexenes, J. Chromatogr., 1984, 312, 75-90, https://doi.org/10.1016/S0021-9673(01)92765-7 . [all data]