Cyclohexene, 4-iodo

Normal alkane RI, non-polar column, custom temperature program

View large format table.

Column type Active phase I Reference Comment
PackedSE-301075.Buchman, Cao, et al., 1984He, Chromosorb AW; Column length: 3.05 m; Program: not specified

References

Buchman, Cao, et al., 1984
Buchman, O.; Cao, G.-Y.; Peng, C.T., Structure assignment by retention index in gas-liquid radiochromatography of substituted cyclohexenes, J. Chromatogr., 1984, 312, 75-90, https://doi.org/10.1016/S0021-9673(01)92765-7 . [all data]